to direction
definition: Direction into which a vector is pointing. The direction is a bearing in the usual geographical sense, measured positive clockwise from due north.
broader: variable property of interest
in scheme: ACTRIS Vocabulary
type: Concept

variable property of interest
type: Concept
narrower: to direction

ACTRIS Vocabulary
type: ConceptScheme