technical requirements
type: Concept
narrower: target uncertainties

target uncertainties
definition: Calculated allowable deviation from a reference standard. May include maximum on the calculated uncertainty of the instrument.
broader: technical requirements
in scheme: ACTRIS Vocabulary
creator: https://orcid.org/0000-0002-3380-3470
type: Concept

ACTRIS Vocabulary
type: ConceptScheme