standard temperature and pressure
definition: Measurement stated with respect to standard temperature, 0 deg C, and standard pressure, 1013.25 hPa.
broader: variable constraints
in scheme: ACTRIS Vocabulary
creator: https://orcid.org/0000-0002-3380-3470
type: Concept

variable constraints
type: Concept
narrower: standard temperature and pressure

ACTRIS Vocabulary
type: ConceptScheme