variable property of interest
type: Concept
narrower: pressure

ACTRIS Vocabulary
type: ConceptScheme

pressure
definition: Force applied perpendicular to the surface of an object per unit area.
broader: variable property of interest
in scheme: ACTRIS Vocabulary
creator: https://orcid.org/0000-0001-9834-5100
type: Concept