instrument status check
type: Concept
narrower: offset angle check

ACTRIS Vocabulary
type: ConceptScheme

offset angle check
is replaced by: offsetanglecheck
deprecated: true
definition: Check the zero angle of the calibrator (for polarization channels)
broader: instrument status check
in scheme: ACTRIS Vocabulary
creator: https://orcid.org/0000-0001-8301-1319
contributor: https://orcid.org/0000-0001-5722-3430
type: Concept