boundary check
type: Concept
narrower: negative error check

negative error check
is replaced by: negativeerrorcheck
deprecated: true
definition: Profile scanning and checking that error on the optical properties is positive for all defined values of the corresponding optical property.
broader: boundary check
in scheme: ACTRIS Vocabulary
creator: https://orcid.org/0000-0001-8301-1319
contributor: https://orcid.org/0000-0003-4157-0838
type: Concept

ACTRIS Vocabulary
type: ConceptScheme