variable property of interest
type: Concept
narrower: mass flux

ACTRIS Vocabulary
type: ConceptScheme

mass flux
definition: Flux of constituent defined in terms of mass concentration per unit area and time
broader: variable property of interest
in scheme: ACTRIS Vocabulary
creator: https://orcid.org/0000-0001-9834-5100
type: Concept