manual sampling
definition: Sample is taken manually by a human, and stored according to specifications according to the analysis method for avoiding contamination.
broader: sampler, others
in scheme: ACTRIS Vocabulary
creator: https://orcid.org/0000-0002-3380-3470
contributor: https://orcid.org/0000-0002-2908-1970
type: Concept

ACTRIS Vocabulary
type: ConceptScheme

sampler, others
type: Concept
narrower: manual sampling