light scattering coefficient
definition: The volume scattering coefficient is the fractional change of radiative flux per unit path length due to the stated process.
definition: Exponent in Lambert-Beer’s law quantifying how much light is removed from an incident light beam while passing through a sample of unit depth exclusively by being scattered away from the incident direction.
broader: variable property of interest
broader: aerosol related
broader: object of interest
in scheme: ACTRIS Vocabulary
creator: https://orcid.org/0000-0002-3380-3470
type: Concept

variable property of interest
type: Concept
narrower: light scattering coefficient

ACTRIS Vocabulary
type: ConceptScheme

aerosol related
type: Concept
narrower: light scattering coefficient

object of interest
type: Concept
narrower: light scattering coefficient