light extinction coefficient
definition: The volume extinction coefficient is the fractional change of radiative flux per unit path length due to the stated process, i.e. due to the sum of particle induced scattering and absorption.
definition: Exponent in Lambert-Beer’s law quantifying how much light is removed from an incident light beam while passing through a sample of unit depth.
broader: variable property of interest
broader: aerosol related
broader: object of interest
in scheme: ACTRIS Vocabulary
creator: https://orcid.org/0000-0002-3380-3470
type: Concept

variable property of interest
type: Concept
narrower: light extinction coefficient

ACTRIS Vocabulary
type: ConceptScheme

aerosol related
type: Concept
narrower: light extinction coefficient

object of interest
type: Concept
narrower: light extinction coefficient