facility type
type: Concept
narrower: laboratory

laboratory
definition: Facility which provides analysis services for offline samples collected on sample media, or calibration services for online instruments of offline analysis.
broader: facility type
in scheme: ACTRIS Vocabulary
creator: https://orcid.org/0000-0002-3380-3470
contributor: https://orcid.org/0000-0002-9592-0584
type: Concept

ACTRIS Vocabulary
type: ConceptScheme