quality control measure type
type: Concept
narrower: instrument intercomparison

instrument intercomparison
definition: Instrument is compared to a reference instrument or a set of other instruments to check unit-to-unit variability.
broader: quality control measure type
in scheme: ACTRIS Vocabulary
creator: https://orcid.org/0000-0002-3380-3470
type: Concept

ACTRIS Vocabulary
type: ConceptScheme