instrument calibration
type: Concept
narrower: instrument calibration, off-site

ACTRIS Vocabulary
type: ConceptScheme

instrument calibration, off-site
definition: The instrument is transported to a calibration facility for calibration.
broader: instrument calibration
in scheme: ACTRIS Vocabulary
creator: https://orcid.org/0000-0002-3380-3470
type: Concept