ACTRIS Vocabulary
type: ConceptScheme

fine-mode
definition: Refers to the particle size range between 10 nm and 1 µm particle diameter.
broader: variable constraints
in scheme: ACTRIS Vocabulary
creator: https://orcid.org/0000-0002-3380-3470
type: Concept

variable constraints
type: Concept
narrower: fine-mode