data quality control measure type
type: Concept
narrower: cross-instrument closure

cross-instrument closure
definition: Measurement is compared to a reference obtained or derived from an independent measurement.
broader: data quality control measure type
in scheme: ACTRIS Vocabulary
creator: https://orcid.org/0000-0002-3380-3470
type: Concept

ACTRIS Vocabulary
type: ConceptScheme