variable geometry
type: Concept
narrower: column total integral

column total integral
definition: Variable is the result of integrating a property over the column of a sample.
broader: variable geometry
in scheme: ACTRIS Vocabulary
creator: https://orcid.org/0000-0002-3380-3470
type: Concept

ACTRIS Vocabulary
type: ConceptScheme