ACTRIS Vocabulary
type: ConceptScheme

variable constraints
type: Concept
narrower: UVA

UVA
definition: Denotes the spectral range of light between 315-400 nm wavelength.
broader: variable constraints
in scheme: ACTRIS Vocabulary
creator: https://orcid.org/0000-0002-3380-3470
type: Concept