combined assessment
type: Concept
narrower: Earlinet legacy data labeled as cirrus contaminated

ACTRIS Vocabulary
type: ConceptScheme

Earlinet legacy data labeled as cirrus contaminated
is replaced by: Earlinetlegacydatalabeledascirruscontaminated
deprecated: true
definition: Data products uploaded before the new release of the database (2019-06-24), labeled as cirrus, and not reporting the cloud mask as vertical information are labeled as Level 1. This control is implemented as a message to data users of handling with care such data, because a cirrus cloud is present but the location in the vertical dimension of such cloud is not precisely reported into the data product.
broader: combined assessment
in scheme: ACTRIS Vocabulary
creator: https://orcid.org/0000-0001-8301-1319
contributor: https://orcid.org/0000-0003-4157-0838
type: Concept