Ångström exponent
definition: The Ångström exponent of an optical property Q dependent on wavelength lambda is alpha in the equation of Q at wavelength lambda as a function of Q at a different wavelength lambda0: Q(lambda) = Q(lambda0) * [lambda/lambda0] ** (-1 * alpha).
broader: variable property of interest
in scheme: ACTRIS Vocabulary
creator: https://orcid.org/0000-0002-3380-3470
type: Concept

variable property of interest
type: Concept
narrower: Ångström exponent

ACTRIS Vocabulary
type: ConceptScheme