quality control outcome
type: Concept
narrower: 3 - Questionable/suspect

ACTRIS Vocabulary
type: ConceptScheme

3 - Questionable/suspect
definition: Failed non-critical documented metric or subjective test(s).
broader: quality control outcome
alternative label: Questionable/suspect
in scheme: ACTRIS Vocabulary
type: Concept