weather sensor
type: Concept
definition: Meteorological base parameter sensor combining observations of air temperature, pressure, humidity, wind speed, wind direction, and precipitation.
broader: meteorological base parameter sensor
in scheme: ACTRIS Vocabulary
creator: https://orcid.org/0000-0002-3380-3470
contributor: https://orcid.org/0000-0003-2042-9333

meteorological base parameter sensor
type: Concept
narrower: weather sensor

ACTRIS Vocabulary
type: ConceptScheme