vertical
type: Concept
definition: Perpendicular to the plane of the horizon.
broader: variable constraints
in scheme: ACTRIS Vocabulary
creator: https://orcid.org/0000-0001-9834-5100

variable constraints
type: Concept
narrower: vertical

ACTRIS Vocabulary
type: ConceptScheme