variable year submission rate
type: Concept
definition: A variable year is defined as one year's worth of data for one variable. The time resolution of the data product is defined by the ACTRIS data management plan (DMP). The instrument has to be operational for at least 75% of the nominal operation time as defined in the DMP. Rate is the number of events per time. A data submission is a delivery of data to a data centre via the means prescribed by the data centre, independent of whether the data meets the criteria for being completely curated.
broader: data provision metrics
in scheme: ACTRIS Vocabulary
creator: https://orcid.org/0000-0002-3380-3470
contributor: https://orcid.org/0000-0003-3587-5926

data provision metrics
type: Concept
narrower: variable year submission rate

ACTRIS Vocabulary
type: ConceptScheme