tracking system check
type: Concept
is replaced by: trackingsystemcheck
deprecated: true
definition: Check if the reference object (sun, moon...) tracking system is nominal.
broader: instrument status check
in scheme: ACTRIS Vocabulary
creator: https://orcid.org/0000-0001-8301-1319
contributor: https://orcid.org/0000-0001-5722-3430

instrument status check
type: Concept
narrower: tracking system check

ACTRIS Vocabulary
type: ConceptScheme