ACTRIS Vocabulary
type: ConceptScheme

surface
type: Concept
definition: Close to the boundary of atmosphere and Earth surface
broader: variable constraints
in scheme: ACTRIS Vocabulary
creator: https://orcid.org/0000-0003-2972-2851

variable constraints
type: Concept
narrower: surface