quality assurance specifications
type: Concept
narrower: standard operating procedures

standard operating procedures
type: Concept
definition: A Standard Operating Procedure is a set of step-by-step instructions compiled by an organization to help workers carry out routine operations.
broader: quality assurance specifications
alternative label: SOP
in scheme: ACTRIS Vocabulary
creator: https://orcid.org/0000-0002-3380-3470

ACTRIS Vocabulary
type: ConceptScheme