spherical fraction
type: Concept
definition: Number of objects having a shape considered as spherical over the total number of these objects.
broader: variable property of interest
in scheme: ACTRIS Vocabulary
creator: https://orcid.org/0000-0002-3380-3470

variable property of interest
type: Concept
narrower: spherical fraction

ACTRIS Vocabulary
type: ConceptScheme