solar
type: Concept
definition: Denotes the spectral range of light between 100-3000 nm wavelength.
broader: variable constraints
in scheme: ACTRIS Vocabulary
creator: https://orcid.org/0000-0002-3380-3470

variable constraints
type: Concept
narrower: solar

ACTRIS Vocabulary
type: ConceptScheme