reduced humidity
type: Concept
definition: Sample humidity reduced from ambient state, stated in the data.
broader: variable constraints
in scheme: ACTRIS Vocabulary
creator: https://orcid.org/0000-0002-3380-3470

variable constraints
type: Concept
narrower: reduced humidity

ACTRIS Vocabulary
type: ConceptScheme