object role
type: Concept
narrower: reaction product

reaction product
type: Concept
definition: Substance produced in the course of a chemical reaction.
broader: object role
in scheme: ACTRIS Vocabulary
creator: https://orcid.org/0000-0002-3380-3470
contributor: https://orcid.org/0000-0001-5158-8703

ACTRIS Vocabulary
type: ConceptScheme