ACTRIS Vocabulary
type: ConceptScheme

precipitation phase
type: Concept
definition: Comprises all hydrometeors with significant fall velocity.
broader: variable matrix
in scheme: ACTRIS Vocabulary
creator: https://orcid.org/0000-0002-8981-0805

variable matrix
type: Concept
narrower: precipitation phase