ACTRIS Vocabulary
type: ConceptScheme

passive sampler on polyurethan foam disk
type: Concept
definition: Device sampling an airborne component on a polyurethan foam sorbent by exposing the sorbent passively to freely circulating air while protecting it from precipitation.
broader: sorbent sampler
in scheme: ACTRIS Vocabulary
creator: https://orcid.org/0000-0002-3380-3470
contributor: https://orcid.org/0000-0002-2908-1970

sorbent sampler
type: Concept
narrower: passive sampler on polyurethan foam disk