compliance
type: Concept
narrower: other

other
type: Concept
definition: Adheres to other types of quality control procedures.
broader: compliance
in scheme: ACTRIS Vocabulary
creator: https://orcid.org/0000-0002-3380-3470

ACTRIS Vocabulary
type: ConceptScheme