naturally negatively charged
type: Concept
definition: Refers to particles with a negative charge in their natural state.
broader: variable constraints
in scheme: ACTRIS Vocabulary
creator: https://orcid.org/0000-0002-3380-3470

variable constraints
type: Concept
narrower: naturally negatively charged

ACTRIS Vocabulary
type: ConceptScheme