model result
type: Concept
definition: Data product is the result of a model calculation.
broader: product type
in scheme: ACTRIS Vocabulary
creator: https://orcid.org/0000-0002-3380-3470

product type
type: Concept
narrower: model result

ACTRIS Vocabulary
type: ConceptScheme