quality control reference use
type: Concept
narrower: laboratory standard

laboratory standard
type: Concept
definition: Standard used as single reference for all calibration standards in a laboratory.
broader: quality control reference use
in scheme: ACTRIS Vocabulary
creator: https://orcid.org/0000-0002-3380-3470

ACTRIS Vocabulary
type: ConceptScheme