variable property of interest
type: Concept
narrower: humidity

humidity
type: Concept
definition: Concentration of water vapour present in sample of air.
broader: variable property of interest
in scheme: ACTRIS Vocabulary
creator: https://orcid.org/0000-0001-9834-5100

ACTRIS Vocabulary
type: ConceptScheme