ACTRIS Vocabulary
type: ConceptScheme

gas phase
type: Concept
definition: Molecules are sufficiently far apart to overcome attractive forces and to fill all available space almost uniformly.
broader: variable matrix
in scheme: ACTRIS Vocabulary
creator: https://orcid.org/0000-0002-3380-3470

variable matrix
type: Concept
narrower: gas phase