variable matrix
type: Concept
narrower: gas and particle phase

ACTRIS vocabulary
type: ConceptScheme

gas and particle phase
type: Concept
definition: Comprised of gas and liquid or solid aerosol particles.
broader: variable matrix
in scheme: ACTRIS vocabulary
creator: https://orcid.org/0000-0002-8981-0805