full quality control applied
type: Concept
definition: The full extend of data quality control as defined by ACTRIS procedures for the property has been applied.
broader: quality control extent
in scheme: ACTRIS Vocabulary
creator: https://orcid.org/0000-0002-3380-3470

quality control extent
type: Concept
narrower: full quality control applied

ACTRIS Vocabulary
type: ConceptScheme