instrument status check
type: Concept
narrower: full overlap minimum height test

full overlap minimum height test
type: Concept
is replaced by: fulloverlapminimumheighttest
deprecated: true
definition: This information is obtained from the Telecover Test and represents the minimum height where the overlap between the laser beam and the receiver field of view is full.
broader: instrument status check
in scheme: ACTRIS Vocabulary
creator: https://orcid.org/0000-0001-8301-1319
contributor: https://orcid.org/0000-0001-5722-3430

ACTRIS Vocabulary
type: ConceptScheme