data use metrics
type: Concept
narrower: experiment dataset download rate

experiment dataset download rate
type: Concept
definition: An experiment dataset is the worth of data produced by one experiment, including data provided by all instruments involved in the experiment. Example of experiments are runs of atmospheric simulation chambers. Rate is the number of events per time. Download includes file download and streaming, counted including fractions of whole variable years. Includes download through interfaces for humans and machines.
broader: data use metrics
in scheme: ACTRIS Vocabulary
creator: https://orcid.org/0000-0002-3380-3470
contributor: https://orcid.org/0000-0003-3587-5926

ACTRIS Vocabulary
type: ConceptScheme