data metrics
type: Concept
narrower: experiment dataset

experiment dataset
type: Concept
definition: Worth of data produced by one experiment, including data provided by all instruments involved in the experiment. Example of experiments are runs of atmospheric simulation chambers.
broader: data metrics
in scheme: ACTRIS Vocabulary
creator: https://orcid.org/0000-0002-3380-3470
contributor: https://orcid.org/0000-0003-3587-5926

ACTRIS Vocabulary
type: ConceptScheme