variable constraints
type: Concept
narrower: dry-state

dry-state
type: Concept
definition: Water vapour removed from sample prior to measurement.
broader: variable constraints
in scheme: ACTRIS Vocabulary
creator: https://orcid.org/0000-0002-3380-3470

ACTRIS Vocabulary
type: ConceptScheme