data quality control measure type
type: Concept
narrower: control against model values

control against model values
type: Concept
definition: Data are compared with output of a predictive model representing place and time data was observed.
broader: data quality control measure type
in scheme: ACTRIS Vocabulary
creator: https://orcid.org/0000-0002-3380-3470

ACTRIS Vocabulary
type: ConceptScheme