combined product
type: Concept
definition: Data analysis product produced from one or several primary observation and / or model data products.
broader: product type
in scheme: ACTRIS Vocabulary
creator: https://orcid.org/0000-0002-3380-3470

product type
type: Concept
narrower: combined product

ACTRIS Vocabulary
type: ConceptScheme