data quality control measure type
type: Concept
narrower: climatological consistency

climatological consistency
type: Concept
definition: Probable consistency - climatological relationship between parameters.
broader: data quality control measure type
in scheme: ACTRIS Vocabulary
creator: https://orcid.org/0000-0002-3380-3470

ACTRIS Vocabulary
type: ConceptScheme