variable property of interest
type: Concept
narrower: amount fraction

ACTRIS vocabulary
type: ConceptScheme

amount fraction
type: Concept
definition: Amount of a constituent, expressed in moles, divided by the total amount of all constituents in a mixture, also expressed in moles.
broader: variable property of interest
alternative label: mole fraction
in scheme: ACTRIS vocabulary
creator: https://orcid.org/0000-0002-3380-3470