air data computer
type: Concept
definition: Aircraft computer system collecting all information about the aircraft position and orientation in the atmosphere.
broader: positioning system
in scheme: ACTRIS Vocabulary
creator: https://orcid.org/0000-0002-3380-3470

positioning system
type: Concept
narrower: air data computer

ACTRIS Vocabulary
type: ConceptScheme