accumulated
type: Concept
definition: Measuremennt has been integrated over a time period.
broader: variable constraints
in scheme: ACTRIS Vocabulary
creator: https://orcid.org/0000-0002-3380-3470

variable constraints
type: Concept
narrower: accumulated

ACTRIS Vocabulary
type: ConceptScheme